06-23-2011 04:57 AM
Downloading: http://maven.alfresco.com/nexus/content/repositories/activiti/org/activiti/activiti-spring/5.7-SNAPS...
Downloading: http://maven.alfresco.com/nexus/content/repositories/activiti-thirdparty/org/activiti/activiti-sprin...
[WARNING] Could not transfer metadata org.activiti:activiti-spring:5.7-SNAPSHOT/maven-metadata.xml from/to activiti (http://maven.alfresco.com/nexus/content/repositories/activiti/😞 No response received after 60000
[WARNING] Could not transfer metadata org.activiti:activiti-spring:5.7-SNAPSHOT/maven-metadata.xml from/to activiti-third-party (http://maven.alfresco.com/nexus/content/repositories/activiti-thirdparty/😞 No response received after 60000
[INFO] ————————————————————————
[INFO] BUILD FAILURE
[INFO] ————————————————————————
[INFO] Total time: 8:02.558s
[INFO] Finished at: Thu Jun 23 10:20:13 CEST 2011
[INFO] Final Memory: 4M/15M
[INFO] ————————————————————————
[ERROR] Failed to execute goal on project activiti-webapp-explorer2: Could not resolve dependencies for project org.activiti:activiti-webapp-explorer2:war:5.7-SNAPSHOT: Failed to collect dependencies for [org.activiti:activiti-engine:jar:5.5-SNAPSHOT (compile), org.activiti:activiti-spring:jar:5.7-SNAPSHOT (compile), javax.servlet:servlet-api:jar:2.5 (compile), com.vaadin:vaadin:jar:6.6.0 (compile), commons-dbcp:commons-dbcp:jar:1.4 (compile), com.h2database:h2:jar:1.2.132 (compile), org.springframework:spring-core:jar:3.0.3.RELEASE (compile), org.springframework:spring-beans:jar:3.0.3.RELEASE (compile), org.springframework:spring-jdbc:jar:3.0.3.RELEASE (compile), org.springframework:spring-web:jar:3.0.3.RELEASE (compile), mysql:mysql-connector-java:jar:5.1.6 (runtime), junit:junit:jar:4.8.1 (compile), com.thebuzzmedia:imgscalr-lib:jar:3.1 (compile)]: Failed to read artifact descriptor for org.activiti:activiti-engine:jar:5.5-SNAPSHOT: Could not transfer artifact org.activiti:activiti-engineom:5.5-SNAPSHOT from/to activiti (http://maven.alfresco.com/nexus/content/repositories/activiti/😞 No response received after 60000 -> [Help 1]
[ERROR]
[ERROR] To see the full stack trace of the errors, re-run Maven with the -e switch.
[ERROR] Re-run Maven using the -X switch to enable full debug logging.
[ERROR]
[ERROR] For more information about the errors and possible solutions, please read the following articles:
[ERROR] [Help 1] http://cwiki.apache.org/confluence/display/MAVEN/DependencyResolutionException
06-23-2011 08:25 AM
06-23-2011 09:26 AM
06-23-2011 01:20 PM
06-24-2011 04:46 AM
08-25-2011 05:04 PM
08-26-2011 03:23 AM
Tags
Find what you came for
We want to make your experience in Hyland Connect as valuable as possible, so we put together some helpful links.